[h323plus] Failure to compile H323 Plus Core 1.19.5

Vlasis Hatzistavrou (KTI) vhatz at kinetix.gr
Wed Oct 24 07:13:54 EDT 2007


I just downloaded and tried to compile H323Plus.

PTLib is compiled smoothly with 'make opt'. However, H323 throws this error:

-I/Downloads/h323+/h323plus/include -I/usr/local/share/pwlib//include 
-Os   -felide-constructors -c h323.cxx -o 
h323.cxx: In member function `virtual BOOL 
/usr/local/include/ptlib/channel.h:823: error: `BOOL 
PChannel::SetErrorValues(PChannel::Errors, int, PChannel::ErrorGroup)' 
is protected
h323.cxx:5529: error: within this context
make[1]: *** [/Downloads/h323+/h323plus/lib/obj_linux_x86_r/h323.o] Error 1
make[1]: Leaving directory `/Downloads/h323+/h323plus/src'
make: *** [opt] Error 2

I don't know if it makes any difference, but I have added:

#define H323_RTP_AGGREGATE 1

in include/openh323buildopts.h

Thanks in advance for any help.
Best regards,
Vlasis Hatzistavrou

More information about the h323plus mailing list